{"text_format":"1","workbook":"xlsx","n_sheets":4,"sheets":["START","Main Dashboard","Cijfers","Blanco"],"not_rendered":{"charts":16,"images":9,"macros":1,"external_links":0,"defined_names":901,"comments":1,"pivot_tables":0},"unopened":[],"bounds":{"document_bytes":16777216,"sheet_cells":100000,"rows_first":2000,"rows_last":500,"rows_between":2000,"halvings":0,"cell_chars":16384,"cell_head_chars":4096},"cells_cut":0,"cells_raw":0,"read":"whole","date_system":"1900"}

{"sheet":"START","index":0,"n_rows":32,"n_cols":11,"rows_kept":32,"cut":false,"hidden":false,"merged":[[13,5,13,8],[11,10,11,12],[13,10,13,11],[24,4,24,12],[1,2,2,12],[3,5,3,13],[11,5,11,8],[15,5,15,8],[7,3,9,4],[17,5,17,8],[19,5,19,8],[5,6,9,12],[3,1,4,4]]}
[]
[null," ","CO2-REDUCTIETOOL ZORG"]
[]
[null,"      MAIN DASHBOARD",null,null,null,"Zet stappen naar klimaatneutraal vastgoed"]
[]
[null,null,"Versie:","2.0  (maart 2025)"]
[null,null,"Voor: ","Care-organisaties"]
[null,null,"Auteurs:","Judith de Bree\nAdriaan van Engelen \nMarjon Olijdam"]
[]
[]
[]
[null,null,null,null,"Zorgorganisatie:","[Naam instelling]",null,null,null,null,"www.milieuplatformzorg.nl"]
[]
[null,null,null,null,"KVK-nummer: ","[0000 0000]",null,null,null,null,"www.stimular.nl"]
[]
{"$rows_left_out":18}
{"sheet":"Main Dashboard","index":1,"n_rows":47,"n_cols":37,"rows_kept":47,"cut":false,"hidden":false,"merged":[[1,3,2,5],[1,6,2,12],[3,1,3,3],[29,13,29,16],[1,25,2,28],[1,18,2,24],[46,26,46,27],[46,29,46,33],[42,22,44,33],[42,6,42,8],[30,22,30,25]]}
[]
[null,null,null,"    SAMENVATTING VAN:",null,null,{"$f":"START!F12","v":"[Naam instelling]"},null,null,null,null,null,null,null,null,null,null,null,"Toon absoluut of per m2 gebruiksoppervlakte",null,null,null,null,null,null,"Versie 2.0 (maart 2025)"]
[]
[]
[]
[]
[]
[null,null,null,null,null,null,null,null,null,null,null,null,null,null,null,null,null,null,null,null,null,null,null,null,null,null,null,null,null,null,null,null,null,null,null,null," "]
[]
[]
[]
[]
[]
[]
[]
{"$rows_left_out":33}
{"sheet":"Cijfers","index":2,"n_rows":411,"n_cols":41,"rows_kept":411,"cut":false,"hidden":false,"merged":[[12,4,14,7],[9,4,10,7],[15,4,17,7],[375,0,375,1],[340,0,340,1],[60,0,60,1],[95,0,95,1],[130,0,130,1],[165,0,165,1],[200,0,200,1],[235,0,235,1],[269,0,269,1],[270,0,270,1],[304,0,304,1],[305,0,305,1],[1,13,2,15],[5,9,6,13],[7,10,7,12],[8,10,8,12],[1,2,2,4],[1,5,2,12],[6,3,8,7],[14,10,14,12],[15,10,15,12],[16,10,16,12],[5,32,6,37],[7,22,16,37],[5,22,6,30],[9,10,9,12],[10,10,10,12],[11,10,11,12],[12,10,12,12],[13,10,13,12]]}
[" "]
[null,null,"   SAMENVATTING VAN:",null,null,{"$f":"START!F12","v":"[Naam instelling]"},null,null,null,null,null,null,null,"Versie 2.0 (maart 2025)",null,null,null,null,null,null,null,null,null,null,null,null,null,null,null,null,null,null,null,null,null,null,null,null,null,null,"wijzig niets"]
[null,null,null,null,null,null,null,null,null,null,null,null,null,null,null,null,null,null,null,null,null,null,null,null,null,null,null,null,null,null,null,null,null,null,null,null,null,null,null,null,"aan deze"]
[null,null,null,null,null,null,null,null,null,null,null,null,null,null,null,null,null,null,null,null,null,null,null,null,null,null,null,null,null,null,null,null,null,null,null,null,null,null,null,null,"kolom."]
[null,null,null,null,null,{"$f":"CELL(\"filename\")","v":"https://stimular.sharepoint.com/Gedeelde documenten/Projecten Stimular/Lopende projecten/813 EVZ-2/4 (eind)producten/Routekaart CO2 Reductie/5. Tool/Main Dashboard/[Main Dashboard 2.0.xlsm]Cijfers"}]
[null,null,null,null,null,null,null,null,null,"Excelbestanden"]
[null,null,null,"Dit is het overkoepelende dashboard bij de CO2 Reductietool Zorg versie 2.0 (maart 2025). Hiermee koppel je tot 10 toolbestanden aan elkaar voor een totaaloverzicht. \n\n"]
[null,null,null,null,null,null,null,null,null,"Excel 1",null,null,null,{"$f":"IF(K8=\"\",0,CONCATENATE(\"=\",\"'\",SUBSTITUTE($F$5,\"Main Dashboard 2.0.xlsm]Cijfers\",K8),\".xlsm]Cijfers\",\"'\",\"!H23\"))","v":0}]
[null,null,null,null,null,null,null,null,null,"Excel 2",null,null,null,{"$f":"IF(K9=\"\",0,CONCATENATE(\"=\",\"'\",SUBSTITUTE($F$5,\"Main Dashboard 2.0.xlsm]Cijfers\",K9),\".xlsm]Cijfers\",\"'\",\"!H23\"))","v":0}]
[null,null,null,"1.","Sla dit Excelbestand op in de map samen met alle Excel toolbestanden die je wilt samenvoegen, onder de exacte naam \"Main Dashboard 2.0\".",null,null,null,null,"Excel 3",null,null,null,0]
[null,null,null,null,null,null,null,null,null,"Excel 4",null,null,null,0]
[null,null,null,null,null,null,null,null,null,"Excel 5",null,null,null,0]
[null,null,null,"2.","Vul de namen van de samen te voegen Excelbestanden hiernaast in. → \n(let op: moet exact overeenkomen en werkt alleen met versie 2.0 of nieuwer).",null,null,null,null,"Excel 6",null,null,null,0]
[null,null,null,null,null,null,null,null,null,"Excel 7",null,null,null,0]
[null,null,null,null,null,null,null,null,null,"Excel 8",null,null,null,0]
{"$rows_left_out":397}
{"sheet":"Blanco","index":3,"n_rows":257,"n_cols":223,"rows_kept":257,"cut":false,"hidden":true,"merged":[[219,13,219,20],[255,2,256,11],[36,2,36,3],[37,2,37,3],[38,2,38,3],[41,4,41,5],[42,4,42,6],[224,2,230,11],[233,2,235,11],[239,2,241,11],[244,2,247,11],[250,2,252,11]]}
[null,null,null,null,{"$f":"IFERROR(AH1,\"Let op! De naam van dit tabblad komt niet overeen met een van de opgegeven locaties in het tabblad 'Cijfers'! Wijzig de naam van dit tabblad in de overzichtsbalk onderin het scherm.\")","v":"Let op! De naam van dit tabblad komt niet overeen met een van de opgegeven locaties in het tabblad 'Cijfers'! Wijzig de naam van dit tabblad in de overzichtsbalk onderin het scherm."},null,null,null,null,null,null,null,null,null,null,null,null,null,null,null,null,null,null,null,null,null,null,null,null,null,null,null,null,{"$f":"MATCH(E2,Cijfers!#REF!,0)","v":{"$error":"#REF!"}},null,null,null,null,null,"Versie 2.0",null,null,null,null,null,null,null,null,null,null,null,null,null,null,null,null,null,null,null,null,null,null,null,null,null,null,null,null,null,null,null,null,null,null,null,null,null,null,null,null,null,null,null,null,null,null,null,null,null,null,null,null,null,null,null,null,null,null,null,null,null,null,null,null,null,null,null,null,null,null,null,null,null,null,null,null,null,null,null,null,null,null,null,null,null,null,null,null,null,null,null,null,null,null,null,null,null,null,null,null,null,null,null,null,null,null,null,null,null,null,null,null,null,null,null,null,null,null,null,null,null,null,null,null,null,null,null,null,null,null,null,null,null,null,null,null,null,null,null,null,null,null,null,null,null,null,null,null,null,null,null,null,null,null,null,null,null,null,null,null,null,null,null,null,null,null,null,null,null,null,null,null,null,null,null,null,null,null,"Huurder","JA","NEE"]
[null,null,"Locatie:",null,{"$f":"MID(CELL(\"bestandsnaam\",D1),SEARCH(\"]\",CELL(\"bestandsnaam\",D1))+1,100)","v":"Blanco"},null,null,null,null,null,null,null,null,null,null,null,null,null,null,"Toon grafiekwaarden absoluut of per m2 gebruiksoppervlakte",null,null,null,null,null,null,null,null,null,null,null,null,null,null,null,null,null,null,null,null,null,null,null,null,null,null,null,null,null,null,null,null,null,null,null,null,null,null,null,null,null,null,null,null,null,null,null,null,null,null,null,null,null,null,null,null,null,null,null,null,null,null,null,null,null,null,null,"Versie 2.0",null,null,null,null,null,null,null,null,null,null,null,null,null,null,null,null,null,null,null,null,null,null,null,null,null,null,null,null,null,null,null,null,null,null,null,null,null,null,null,null,null,null,null,null,null,null,null,null,null,null,null,null,null,null,null,null,null,null,null,null,null,null,null,null,null,null,null,null,null,null,null,null,null,null,null,null,null,null,null,null,null,null,null,null,null,null,null,null,null,null,null,null,null,null,null,null,null,null,null,null,null,null,null,null,null,null,null,null,null,null,null,null,null,null,null,null,null,null,null,null,null,null,null,null,null,null,null,null,null,null,"Verhuurder",2018]
[null,null,null,null,null,null,null,null,null,null,null,null,null,null,null,null,null,null,null,null,null,null,null,null,null,null,null,null,null,null,null,null,null,null,null,null,null,null,null,null,null,null,null,null,null,null,null,null,null,null,null,null,null,null,null,null,null,null,null,null,null,null,null,null,null,null,null,null,null,null,null,null,null,null,null,null,null,null,null,null,null,null,null,null,null,null,null,null,null,null,null,null,null,null,null,null,null,null,null,null,null,null,null,null,null,null,null,null,null,null,null,null,null,null,null,null,null,null,null,null,null,null,null,null,null,null,null,null,null,null,null,null,null,null,null,null,null,null,null,null,null,null,null,null,null,null,null,null,null,null,null,null,null,null,null,null,null,null,null,null,null,null,null,null,null,null,null,null,null,null,null,null,null,null,null,null,null,null,null,null,null,null,null,null,null,null,null,null,null,null,null,null,null,null,null,null,null,null,null,null,null,null,null,null,null,null,null,null,null,null,null,null,null,null,null,null,null,null,"X",2019]
[null,null,null,"Bruto vloeroppervlak - BVO (m2)",null,null,null,null,null,null,null,null,null,null,null,null,null,null,null,null,null,null,null,null,null,null,null,null,null,null,null,null,null,null,null,null,null,null,null,null,null,null,null,null,null,null,null,null,null,null,null,null,null,null,null,null,null,null,null,null,null,null,null,null,null,null,null,null,null,null,null,null,null,null,null,null,null,null,null,null,null,null,null,null,null,null,null,null,null,null,null,null,null,null,null,null,null,null,null,null,null,null,null,null,null,null,null,null,null,null,null,null,null,null,null,null,null,null,null,null,null,null,null,null,null,null,null,null,null,null,null,null,null,null,null,null,null,null,null,null,null,null,null,null,null,null,null,null,null,null,null,null,null,null,null,null,null,null,null,null,null,null,null,null,null,null,null,null,null,null,null,null,null,null,null,null,null,null,null,null,null,null,null,null,null,null,null,null,null,null,null,null,null,null,null,null,null,null,null,null,null,null,null,null,null,null,null,null,null,null,null,null,null,null,null,null,null,null,"I",2020]
[null,null,{"$f":"IF(C4<3000,C4*0.84,C4*0.88)","v":0},"Gebruiksoppervlakte - GO (m2)",null,{"$f":"CELL(\"filename\")","v":"https://stimular.sharepoint.com/Gedeelde documenten/Projecten Stimular/Lopende projecten/813 EVZ-2/4 (eind)producten/Routekaart CO2 Reductie/5. Tool/Main Dashboard/[Main Dashboard 2.0.xlsm]Cijfers"},null,null,null,null,null,null,null,null,null,null,null,null,null,null,null,null,null,null,null,null,null,null,null,null,null,null,null,null,null,null,null,null,null,null,null,null,null,null,null,null,null,null,null,null,null,null,null,null,null,null,null,null,null,null,null,null,null,null,null,null,null,null,null,null,null,null,null,null,null,null,null,null,null,null,null,null,null,null,null,null,null,null,null,null,null,null,null,null,null,null,null,null,null,null,null,null,null,null,null,null,null,null,null,null,null,null,null,null,null,null,null,null,null,null,null,null,null,null,null,null,null,null,null,null,null,null,null,null,null,null,null,null,null,null,null,null,null,null,null,null,null,null,null,null,null,null,null,null,null,null,null,null,null,null,null,null,null,null,null,null,null,null,null,null,null,null,null,null,null,null,null,null,null,null,null,null,null,null,null,null,null,null,null,null,null,null,null,null,null,null,null,null,null,null,null,null,null,null,null,null,null,null,null,null,null,null,null,null,null,null,null,null,"V",2021]
[null,null,1,"Bouwlagen",null,null,null,null,null,null,null,null,null,null,null,null,null,null,null,null,null,null,null,null,null,null,null,null,null,null,null,null,null,null,null,null,null,null,null,null,null,null,null,null,null,null,null,null,null,null,null,null,null,null,null,null,null,null,null,null,null,null,null,null,null,null,null,null,null,null,null,null,null,null,null,null,null,null,null,null,null,null,null,null,null,null,null,null,null,null,null,null,null,null,null,null,null,null,null,null,null,null,null,null,null,null,null,null,null,null,null,null,null,null,null,null,null,null,null,null,null,null,null,null,null,null,null,null,null,null,null,null,null,null,null,null,null,null,null,null,null,null,null,null,null,null,null,null,null,null,null,null,null,null,null,null,null,null,null,null,null,null,null,null,null,null,null,null,null,null,null,null,null,null,null,null,null,null,null,null,null,null,null,null,null,null,null,null,null,null,null,null,null,null,null,null,null,null,null,null,null,null,null,null,null,null,null,null,null,null,null,null,null,null,null,null,null,null,"H",2022]
[null,null,1,"Aantal panden op de locatie",null,null,null,null,null,null,null,null,null,null,null,null,null,null,null,null,null,null,null,null,null,null,null,null,null,null,null,null,null,null,null,null,null,null,null,null,null,null,null,null,null,null,null,null,null,null,null,null,null,null,null,null,null,null,null,null,null,null,null,null,null,null,null,null,null,null,null,null,null,null,null,null,null,null,null,null,null,null,null,null,null,null,null,null,null,null,null,null,null,null,null,null,null,null,null,null,null,null,null,null,null,null,null,null,null,null,null,null,null,null,null,null,null,null,null,null,null,null,null,null,null,null,null,null,null,null,null,null,null,null,null,null,null,null,null,null,null,null,null,null,null,null,null,null,null,null,null,null,null,null,null,null,null,null,null,null,null,null,null,null,null,null,null,null,null,null,null,null,null,null,null,null,null,null,null,null,null,null,null,null,null,null,null,null,null,null,null,null,null,null,null,null,null,null,null,null,null,null,null,null,null,null,null,null,null,null,null,null,null,null,null,null,null,null,"ja",2023]
[null,null,null,null,null,null,null,null,null,null,null,null,null,null,null,null,null,null,null,null,null,null,null,null,null,null,null,null,null,null,null,null,null,null,null,null,null,null,null,null,null,null,null,null,null,null,null,null,null,null,null,null,null,null,null,null,null,null,null,null,null,null,null,null,null,null,null,null,null,null,null,null,null,null,null,null,null,null,null,null,null,null,null,null,null,null,null,null,null,null,null,null,null,null,null,null,null,null,null,null,null,null,null,null,null,null,null,null,null,null,null,null,null,null,null,null,null,null,null,null,null,null,null,null,null,null,null,null,null,null,null,null,null,null,null,null,null,null,null,null,null,null,null,null,null,null,null,null,null,null,null,null,null,null,null,null,null,null,null,null,null,null,null,null,null,null,null,null,null,null,null,null,null,null,null,null,null,null,null,null,null,null,null,null,null,null,null,null,null,null,null,null,null,null,null,null,null,null,null,null,null,null,null,null,null,null,null,null,null,null,null,null,null,null,null,null,null,null,"huur",2024]
[null,null,null,"Bouwjaar",null,null,null,null,null,null,null,null,null,null,null,null,null,null,null,null,null,null,null,null,null,null,null,null,null,null,null,null,null,null,null,null,null,null,null,null,null,null,null,null,null,null,null,null,null,null,null,null,null,null,null,null,null,null,null,null,null,null,null,null,null,null,null,null,null,null,null,null,null,null,null,null,null,null,null,null,null,null,null,null,null,null,null,null,null,null,null,null,null,null,null,null,null,null,null,null,null,null,null,null,null,null,null,null,null,null,null,null,null,null,null,null,null,null,null,null,null,null,null,null,null,null,null,null,null,null,null,null,null,null,null,null,null,null,null,null,null,null,null,null,null,null,null,null,null,null,null,null,null,null,null,null,null,null,null,null,null,null,null,null,null,null,null,null,null,null,null,null,null,null,null,null,null,null,null,null,null,null,null,null,null,null,null,null,null,null,null,null,null,null,null,null,null,null,null,null,null,null,null,null,null,null,null,null,null,null,null,null,null,null,null,null,null,null,"eigendom",2025]
[null,null,"Nee","Is locatie een monument?",null,null,null,null,null,null,null,null,null,null,null,null,null,null,null,null,null,null,null,null,null,null,null,null,null,null,null,null,null,null,null,null,null,null,null,null,null,null,null,null,null,null,null,null,null,null,null,null,null,null,null,null,null,null,null,null,null,null,null,null,null,null,null,null,null,null,null,null,null,null,null,null,null,null,null,null,null,null,null,null,null,null,null,null,null,null,null,null,null,null,null,null,null,null,null,null,null,null,null,null,null,null,null,null,null,null,null,null,null,null,null,null,null,null,null,null,null,null,null,null,null,null,null,null,null,null,null,null,null,null,null,null,null,null,null,null,null,null,null,null,null,null,null,null,null,null,null,null,null,null,null,null,null,null,null,null,null,null,null,null,null,null,null,null,null,null,null,null,null,null,null,null,null,null,null,null,null,null,null,null,null,null,null,null,null,null,null,null,null,null,null,null,null,null,null,null,null,null,null,null,null,null,null,null,null,null,null,null,null,null,null,null,null,null,"Brons",2026]
[null,null,null,"Jaar van ingebruikname na 2023 [optioneel]",null,null,null,null,null,null,null,null,null,null,null,null,null,null,null,null,null,null,null,null,null,null,null,null,null,null,null,null,null,null,null,null,null,null,null,null,null,null,null,null,null,null,null,null,null,null,null,null,null,null,null,null,null,null,null,null,null,null,null,null,null,null,null,null,null,null,null,null,null,null,null,null,null,null,null,null,null,null,null,null,null,null,null,null,null,null,null,null,null,null,null,null,null,null,null,null,null,null,null,null,null,null,null,null,null,null,null,null,null,null,null,null,null,null,null,null,null,null,null,null,null,null,null,null,null,null,null,null,null,null,null,null,null,null,null,null,null,null,null,null,null,null,null,null,null,null,null,null,null,null,null,null,null,null,null,null,null,null,null,null,null,null,null,null,null,null,null,null,null,null,null,null,null,null,null,null,null,null,null,null,null,null,null,null,null,null,null,null,null,null,null,null,null,null,null,null,null,null,null,null,null,null,null,null,null,null,null,null,null,null,null,null,null,null,"Zilver",2027]
[null,null,"2050 of later","Jaar van afstoot/sloop",null,null,null,null,null,null,null,null,null,null,null,null,null,null,null,null,null,null,null,null,null,null,null,null,null,null,null,null,null,null,null,null,null,null,null,null,null,null,null,null,null,null,null,null,null,null,null,null,null,null,null,null,null,null,null,null,null,null,null,null,null,null,null,null,null,null,null,null,null,null,null,null,null,null,null,null,null,null,null,null,null,null,null,null,null,null,null,null,null,null,null,null,null,null,null,null,null,null,null,null,null,null,null,null,null,null,null,null,null,null,null,null,null,null,null,null,null,null,null,null,null,null,null,null,null,null,null,null,null,null,null,null,null,null,null,null,null,null,null,null,null,null,null,null,null,null,null,null,null,null,null,null,null,null,null,null,null,null,null,null,null,null,null,null,null,null,null,null,null,null,null,null,null,null,null,null,null,null,null,null,null,null,null,null,null,null,null,null,null,null,null,null,null,null,null,null,null,null,null,null,null,null,null,null,null,null,null,null,null,null,null,null,null,null,"Goud",2028]
[null,null,null,null,null,null,null,null,null,null,null,null,null,null,null,null,null,null,null,null,null,null,null,null,null,null,null,null,null,null,null,null,null,null,null,null,null,null,null,null,null,null,null,null,null,null,null,null,null,null,null,null,null,null,null,null,null,null,null,null,null,null,null,null,null,null,null,null,null,null,null,null,null,null,null,null,null,null,null,null,null,null,null,null,null,null,null,null,null,null,null,null,null,null,null,null,null,null,null,null,null,null,null,null,null,null,null,null,null,null,null,null,null,null,null,null,null,null,null,null,null,null,null,null,null,null,null,null,null,null,null,null,null,null,null,null,null,null,null,null,null,null,null,null,null,null,null,null,null,null,null,null,null,null,null,null,null,null,null,null,null,null,null,null,null,null,null,null,null,null,null,null,null,null,null,null,null,null,null,null,null,null,null,null,null,null,null,null,null,null,null,null,null,null,null,null,null,null,null,null,null,null,null,null,null,null,null,null,null,null,null,null,null,null,null,null,null,null,null,2029]
[null,null,{"$f":"IF(OR((AN31+AN37)>50000,AN32>25000,AN33>781),\"Ja\",\"Nee\")","v":"Nee"},"Is de locatie informatieplichtig?",null,null,null,null,null,null,null,null,null,null,null,null,null,null,null,null,null,null,null,null,null,null,null,null,null,null,null,null,null,null,null,null,null,null,null,null,null,null,null,null,null,null,null,null,null,null,null,null,null,null,null,null,null,null,null,null,null,null,null,null,null,null,null,null,null,null,null,null,null,null,null,null,null,null,null,null,null,null,null,null,null,null,null,null,null,null,null,null,null,null,null,null,null,null,null,null,null,null,null,null,null,null,null,null,null,null,null,null,null,null,null,null,null,null,null,null,null,null,null,null,null,null,null,null,null,null,null,null,null,null,null,null,null,null,null,null,null,null,null,null,null,null,null,null,null,null,null,null,null,null,null,null,null,null,null,null,null,null,null,null,null,null,null,null,null,null,null,null,null,null,null,null,null,null,null,null,null,null,null,null,null,null,null,null,null,null,null,null,null,null,null,null,null,null,null,null,null,null,null,null,null,null,null,null,null,null,null,null,null,null,null,null,null,null,null,2030]
[null,null,"Eigendom","Huur/eigendom",null,null,null,null,null,null,null,null,null,null,null,null,null,null,null,null,null,null,null,null,null,null,null,null,null,null,null,null,null,null,null,null,null,null,null,null,null,null,null,null,null,null,null,null,null,null,null,null,null,null,null,null,null,null,null,null,null,null,null,null,null,null,null,null,null,null,null,null,null,null,null,null,null,null,null,null,null,null,null,null,null,null,null,null,null,null,null,null,null,null,null,null,null,null,null,null,null,null,null,null,null,null,null,null,null,null,null,null,null,null,null,null,null,null,null,null,null,null,null,null,null,null,null,null,null,null,null,null,null,null,null,null,null,null,null,null,null,null,null,null,null,null,null,null,null,null,null,null,null,null,null,null,null,null,null,null,null,null,null,null,null,null,null,null,null,null,null,null,null,null,null,null,null,null,null,null,null,null,null,null,null,null,null,null,null,null,null,null,null,null,null,null,null,null,null,null,null,null,null,null,null,null,null,null,null,null,null,null,null,null,null,null,null,null,null,2031]
{"$rows_left_out":242}